[ create a new paste ] login | about

Link: http://codepad.org/98pZB5jv    [ raw code | fork ]

Plain Text, pasted on Jul 20:
version:1
:debug:main poco has no conflicts
:debug:main Executing org.macports.main (poco)
:debug:main Skipping completed org.macports.archivefetch (poco)
:debug:main Skipping completed org.macports.fetch (poco)
:debug:main Skipping completed org.macports.checksum (poco)
:debug:main Skipping completed org.macports.extract (poco)
:debug:main Skipping completed org.macports.patch (poco)
:debug:main Skipping completed org.macports.configure (poco)
:debug:build build phase started at Fri Jul 20 15:57:28 BST 2012
:notice:build --->  Building poco
:debug:build Executing org.macports.build (poco)
:debug:build Environment: CPATH='/opt/local/include' CC_PRINT_OPTIONS_FILE='/opt/local/var/macports/build/_opt_local_var_macports_sources_rsync.macports.org_release_ports_devel_poco/poco/work/.CC_PRINT_OPTIONS' LIBRARY_PATH='/opt/local/lib' CC_PRINT_OPTIONS='YES' MACOSX_DEPLOYMENT_TARGET='10.6'
:debug:build Assembled command: 'cd "/opt/local/var/macports/build/_opt_local_var_macports_sources_rsync.macports.org_release_ports_devel_poco/poco/work/poco-1.3.6p2-all" && /usr/bin/make -j4 -w poco CC=/usr/bin/clang CXX=/usr/bin/clang++ CPP=/usr/bin/cpp'
:debug:build Executing command line:  cd "/opt/local/var/macports/build/_opt_local_var_macports_sources_rsync.macports.org_release_ports_devel_poco/poco/work/poco-1.3.6p2-all" && /usr/bin/make -j4 -w poco CC=/usr/bin/clang CXX=/usr/bin/clang++ CPP=/usr/bin/cpp 
:info:build make: Entering directory `/opt/local/var/macports/build/_opt_local_var_macports_sources_rsync.macports.org_release_ports_devel_poco/poco/work/poco-1.3.6p2-all'
:info:build /usr/bin/make -C /opt/local/var/macports/build/_opt_local_var_macports_sources_rsync.macports.org_release_ports_devel_poco/poco/work/poco-1.3.6p2-all/Foundation
:info:build /usr/bin/make -C /opt/local/var/macports/build/_opt_local_var_macports_sources_rsync.macports.org_release_ports_devel_poco/poco/work/poco-1.3.6p2-all/CppUnit 
:info:build make[1]: Entering directory `/opt/local/var/macports/build/_opt_local_var_macports_sources_rsync.macports.org_release_ports_devel_poco/poco/work/poco-1.3.6p2-all/CppUnit'
:info:build make[1]: Nothing to be done for `all'.
:info:build make[1]: Leaving directory `/opt/local/var/macports/build/_opt_local_var_macports_sources_rsync.macports.org_release_ports_devel_poco/poco/work/poco-1.3.6p2-all/CppUnit'
:info:build make[1]: Entering directory `/opt/local/var/macports/build/_opt_local_var_macports_sources_rsync.macports.org_release_ports_devel_poco/poco/work/poco-1.3.6p2-all/Foundation'
:info:build ** Compiling src/AsyncChannel.cpp (debug, shared)
:info:build ** Compiling src/Base64Encoder.cpp (debug, shared)
:info:build /usr/bin/clang++  -Iinclude -I/opt/local/var/macports/build/_opt_local_var_macports_sources_rsync.macports.org_release_ports_devel_poco/poco/work/poco-1.3.6p2-all/CppUnit/include -I/opt/local/var/macports/build/_opt_local_var_macports_sources_rsync.macports.org_release_ports_devel_poco/poco/work/poco-1.3.6p2-all/Foundation/include -I/opt/local/var/macports/build/_opt_local_var_macports_sources_rsync.macports.org_release_ports_devel_poco/poco/work/poco-1.3.6p2-all/XML/include -I/opt/local/var/macports/build/_opt_local_var_macports_sources_rsync.macports.org_release_ports_devel_poco/poco/work/poco-1.3.6p2-all/Util/include -I/opt/local/var/macports/build/_opt_local_var_macports_sources_rsync.macports.org_release_ports_devel_poco/poco/work/poco-1.3.6p2-all/Net/include -I/opt/local/var/macports/build/_opt_local_var_macports_sources_rsync.macports.org_release_ports_devel_poco/poco/work/poco-1.3.6p2-all/Crypto/include -I/opt/local/var/macports/build/_opt_local_var_macports_sources_rsync.macports.org_release_ports_devel_poco/poco/work/poco-1.3.6p2-all/NetSSL_OpenSSL/include -I/opt/local/var/macports/build/_opt_local_var_macports_sources_rsync.macports.org_release_ports_devel_poco/poco/work/poco-1.3.6p2-all/Data/include -I/opt/local/var/macports/build/_opt_local_var_macports_sources_rsync.macports.org_release_ports_devel_poco/poco/work/poco-1.3.6p2-all/Data/SQLite/include -I/opt/local/var/macports/build/_opt_local_var_macports_sources_rsync.macports.org_release_ports_devel_poco/poco/work/poco-1.3.6p2-all/Data/ODBC/include -I/opt/local/var/macports/build/_opt_local_var_macports_sources_rsync.macports.org_release_ports_devel_poco/poco/work/poco-1.3.6p2-all/Data/MySQL/include -I/opt/local/var/macports/build/_opt_local_var_macports_sources_rsync.macports.org_release_ports_devel_poco/poco/work/poco-1.3.6p2-all/Zip/include -I/opt/local/var/macports/build/_opt_local_var_macports_sources_rsync.macports.org_release_ports_devel_poco/poco/work/poco-1.3.6p2-all/PageCompiler/include -arch x86_64 -Wall -Wno-sign-compare -I/opt/local/include -O2 -DPOCO_BUILD_HOST=nikos-yiotiss-macbook-pro.local  -DPOCO_HAVE_IPv6  -O0 -g -gdwarf-2 -D_DEBUG= -D_GLIBCXX_DEBUG=1 -D_GLIBCXX_DEBUG_PEDANTIC=1 -mfix-and-continue -fvisibility-inlines-hidden  -fPIC -c src/AsyncChannel.cpp -o /opt/local/var/macports/build/_opt_local_var_macports_sources_rsync.macports.org_release_ports_devel_poco/poco/work/poco-1.3.6p2-all/Foundation/obj/Darwin/x86_64/debug_shared/AsyncChannel.o
:info:build ** Compiling src/BinaryReader.cpp (debug, shared)
:info:build /usr/bin/clang++  -Iinclude -I/opt/local/var/macports/build/_opt_local_var_macports_sources_rsync.macports.org_release_ports_devel_poco/poco/work/poco-1.3.6p2-all/CppUnit/include -I/opt/local/var/macports/build/_opt_local_var_macports_sources_rsync.macports.org_release_ports_devel_poco/poco/work/poco-1.3.6p2-all/Foundation/include -I/opt/local/var/macports/build/_opt_local_var_macports_sources_rsync.macports.org_release_ports_devel_poco/poco/work/poco-1.3.6p2-all/XML/include -I/opt/local/var/macports/build/_opt_local_var_macports_sources_rsync.macports.org_release_ports_devel_poco/poco/work/poco-1.3.6p2-all/Util/include -I/opt/local/var/macports/build/_opt_local_var_macports_sources_rsync.macports.org_release_ports_devel_poco/poco/work/poco-1.3.6p2-all/Net/include -I/opt/local/var/macports/build/_opt_local_var_macports_sources_rsync.macports.org_release_ports_devel_poco/poco/work/poco-1.3.6p2-all/Crypto/include -I/opt/local/var/macports/build/_opt_local_var_macports_sources_rsync.macports.org_release_ports_devel_poco/poco/work/poco-1.3.6p2-all/NetSSL_OpenSSL/include -I/opt/local/var/macports/build/_opt_local_var_macports_sources_rsync.macports.org_release_ports_devel_poco/poco/work/poco-1.3.6p2-all/Data/include -I/opt/local/var/macports/build/_opt_local_var_macports_sources_rsync.macports.org_release_ports_devel_poco/poco/work/poco-1.3.6p2-all/Data/SQLite/include -I/opt/local/var/macports/build/_opt_local_var_macports_sources_rsync.macports.org_release_ports_devel_poco/poco/work/poco-1.3.6p2-all/Data/ODBC/include -I/opt/local/var/macports/build/_opt_local_var_macports_sources_rsync.macports.org_release_ports_devel_poco/poco/work/poco-1.3.6p2-all/Data/MySQL/include -I/opt/local/var/macports/build/_opt_local_var_macports_sources_rsync.macports.org_release_ports_devel_poco/poco/work/poco-1.3.6p2-all/Zip/include -I/opt/local/var/macports/build/_opt_local_var_macports_sources_rsync.macports.org_release_ports_devel_poco/poco/work/poco-1.3.6p2-all/PageCompiler/include -arch x86_64 -Wall -Wno-sign-compare -I/opt/local/include -O2 -DPOCO_BUILD_HOST=nikos-yiotiss-macbook-pro.local  -DPOCO_HAVE_IPv6  -O0 -g -gdwarf-2 -D_DEBUG= -D_GLIBCXX_DEBUG=1 -D_GLIBCXX_DEBUG_PEDANTIC=1 -mfix-and-continue -fvisibility-inlines-hidden  -fPIC -c src/Base64Encoder.cpp -o /opt/local/var/macports/build/_opt_local_var_macports_sources_rsync.macports.org_release_ports_devel_poco/poco/work/poco-1.3.6p2-all/Foundation/obj/Darwin/x86_64/debug_shared/Base64Encoder.o
:info:build ** Compiling src/BinaryWriter.cpp (debug, shared)
:info:build /usr/bin/clang++  -Iinclude -I/opt/local/var/macports/build/_opt_local_var_macports_sources_rsync.macports.org_release_ports_devel_poco/poco/work/poco-1.3.6p2-all/CppUnit/include -I/opt/local/var/macports/build/_opt_local_var_macports_sources_rsync.macports.org_release_ports_devel_poco/poco/work/poco-1.3.6p2-all/Foundation/include -I/opt/local/var/macports/build/_opt_local_var_macports_sources_rsync.macports.org_release_ports_devel_poco/poco/work/poco-1.3.6p2-all/XML/include -I/opt/local/var/macports/build/_opt_local_var_macports_sources_rsync.macports.org_release_ports_devel_poco/poco/work/poco-1.3.6p2-all/Util/include -I/opt/local/var/macports/build/_opt_local_var_macports_sources_rsync.macports.org_release_ports_devel_poco/poco/work/poco-1.3.6p2-all/Net/include -I/opt/local/var/macports/build/_opt_local_var_macports_sources_rsync.macports.org_release_ports_devel_poco/poco/work/poco-1.3.6p2-all/Crypto/include -I/opt/local/var/macports/build/_opt_local_var_macports_sources_rsync.macports.org_release_ports_devel_poco/poco/work/poco-1.3.6p2-all/NetSSL_OpenSSL/include -I/opt/local/var/macports/build/_opt_local_var_macports_sources_rsync.macports.org_release_ports_devel_poco/poco/work/poco-1.3.6p2-all/Data/include -I/opt/local/var/macports/build/_opt_local_var_macports_sources_rsync.macports.org_release_ports_devel_poco/poco/work/poco-1.3.6p2-all/Data/SQLite/include -I/opt/local/var/macports/build/_opt_local_var_macports_sources_rsync.macports.org_release_ports_devel_poco/poco/work/poco-1.3.6p2-all/Data/ODBC/include -I/opt/local/var/macports/build/_opt_local_var_macports_sources_rsync.macports.org_release_ports_devel_poco/poco/work/poco-1.3.6p2-all/Data/MySQL/include -I/opt/local/var/macports/build/_opt_local_var_macports_sources_rsync.macports.org_release_ports_devel_poco/poco/work/poco-1.3.6p2-all/Zip/include -I/opt/local/var/macports/build/_opt_local_var_macports_sources_rsync.macports.org_release_ports_devel_poco/poco/work/poco-1.3.6p2-all/PageCompiler/include -arch x86_64 -Wall -Wno-sign-compare -I/opt/local/include -O2 -DPOCO_BUILD_HOST=nikos-yiotiss-macbook-pro.local  -DPOCO_HAVE_IPv6  -O0 -g -gdwarf-2 -D_DEBUG= -D_GLIBCXX_DEBUG=1 -D_GLIBCXX_DEBUG_PEDANTIC=1 -mfix-and-continue -fvisibility-inlines-hidden  -fPIC -c src/BinaryReader.cpp -o /opt/local/var/macports/build/_opt_local_var_macports_sources_rsync.macports.org_release_ports_devel_poco/poco/work/poco-1.3.6p2-all/Foundation/obj/Darwin/x86_64/debug_shared/BinaryReader.o
:info:build /usr/bin/clang++  -Iinclude -I/opt/local/var/macports/build/_opt_local_var_macports_sources_rsync.macports.org_release_ports_devel_poco/poco/work/poco-1.3.6p2-all/CppUnit/include -I/opt/local/var/macports/build/_opt_local_var_macports_sources_rsync.macports.org_release_ports_devel_poco/poco/work/poco-1.3.6p2-all/Foundation/include -I/opt/local/var/macports/build/_opt_local_var_macports_sources_rsync.macports.org_release_ports_devel_poco/poco/work/poco-1.3.6p2-all/XML/include -I/opt/local/var/macports/build/_opt_local_var_macports_sources_rsync.macports.org_release_ports_devel_poco/poco/work/poco-1.3.6p2-all/Util/include -I/opt/local/var/macports/build/_opt_local_var_macports_sources_rsync.macports.org_release_ports_devel_poco/poco/work/poco-1.3.6p2-all/Net/include -I/opt/local/var/macports/build/_opt_local_var_macports_sources_rsync.macports.org_release_ports_devel_poco/poco/work/poco-1.3.6p2-all/Crypto/include -I/opt/local/var/macports/build/_opt_local_var_macports_sources_rsync.macports.org_release_ports_devel_poco/poco/work/poco-1.3.6p2-all/NetSSL_OpenSSL/include -I/opt/local/var/macports/build/_opt_local_var_macports_sources_rsync.macports.org_release_ports_devel_poco/poco/work/poco-1.3.6p2-all/Data/include -I/opt/local/var/macports/build/_opt_local_var_macports_sources_rsync.macports.org_release_ports_devel_poco/poco/work/poco-1.3.6p2-all/Data/SQLite/include -I/opt/local/var/macports/build/_opt_local_var_macports_sources_rsync.macports.org_release_ports_devel_poco/poco/work/poco-1.3.6p2-all/Data/ODBC/include -I/opt/local/var/macports/build/_opt_local_var_macports_sources_rsync.macports.org_release_ports_devel_poco/poco/work/poco-1.3.6p2-all/Data/MySQL/include -I/opt/local/var/macports/build/_opt_local_var_macports_sources_rsync.macports.org_release_ports_devel_poco/poco/work/poco-1.3.6p2-all/Zip/include -I/opt/local/var/macports/build/_opt_local_var_macports_sources_rsync.macports.org_release_ports_devel_poco/poco/work/poco-1.3.6p2-all/PageCompiler/include -arch x86_64 -Wall -Wno-sign-compare -I/opt/local/include -O2 -DPOCO_BUILD_HOST=nikos-yiotiss-macbook-pro.local  -DPOCO_HAVE_IPv6  -O0 -g -gdwarf-2 -D_DEBUG= -D_GLIBCXX_DEBUG=1 -D_GLIBCXX_DEBUG_PEDANTIC=1 -mfix-and-continue -fvisibility-inlines-hidden  -fPIC -c src/BinaryWriter.cpp -o /opt/local/var/macports/build/_opt_local_var_macports_sources_rsync.macports.org_release_ports_devel_poco/poco/work/poco-1.3.6p2-all/Foundation/obj/Darwin/x86_64/debug_shared/BinaryWriter.o
:info:build ** Compiling src/Bugcheck.cpp (debug, shared)
:info:build /usr/bin/clang++  -Iinclude -I/opt/local/var/macports/build/_opt_local_var_macports_sources_rsync.macports.org_release_ports_devel_poco/poco/work/poco-1.3.6p2-all/CppUnit/include -I/opt/local/var/macports/build/_opt_local_var_macports_sources_rsync.macports.org_release_ports_devel_poco/poco/work/poco-1.3.6p2-all/Foundation/include -I/opt/local/var/macports/build/_opt_local_var_macports_sources_rsync.macports.org_release_ports_devel_poco/poco/work/poco-1.3.6p2-all/XML/include -I/opt/local/var/macports/build/_opt_local_var_macports_sources_rsync.macports.org_release_ports_devel_poco/poco/work/poco-1.3.6p2-all/Util/include -I/opt/local/var/macports/build/_opt_local_var_macports_sources_rsync.macports.org_release_ports_devel_poco/poco/work/poco-1.3.6p2-all/Net/include -I/opt/local/var/macports/build/_opt_local_var_macports_sources_rsync.macports.org_release_ports_devel_poco/poco/work/poco-1.3.6p2-all/Crypto/include -I/opt/local/var/macports/build/_opt_local_var_macports_sources_rsync.macports.org_release_ports_devel_poco/poco/work/poco-1.3.6p2-all/NetSSL_OpenSSL/include -I/opt/local/var/macports/build/_opt_local_var_macports_sources_rsync.macports.org_release_ports_devel_poco/poco/work/poco-1.3.6p2-all/Data/include -I/opt/local/var/macports/build/_opt_local_var_macports_sources_rsync.macports.org_release_ports_devel_poco/poco/work/poco-1.3.6p2-all/Data/SQLite/include -I/opt/local/var/macports/build/_opt_local_var_macports_sources_rsync.macports.org_release_ports_devel_poco/poco/work/poco-1.3.6p2-all/Data/ODBC/include -I/opt/local/var/macports/build/_opt_local_var_macports_sources_rsync.macports.org_release_ports_devel_poco/poco/work/poco-1.3.6p2-all/Data/MySQL/include -I/opt/local/var/macports/build/_opt_local_var_macports_sources_rsync.macports.org_release_ports_devel_poco/poco/work/poco-1.3.6p2-all/Zip/include -I/opt/local/var/macports/build/_opt_local_var_macports_sources_rsync.macports.org_release_ports_devel_poco/poco/work/poco-1.3.6p2-all/PageCompiler/include -arch x86_64 -Wall -Wno-sign-compare -I/opt/local/include -O2 -DPOCO_BUILD_HOST=nikos-yiotiss-macbook-pro.local  -DPOCO_HAVE_IPv6  -O0 -g -gdwarf-2 -D_DEBUG= -D_GLIBCXX_DEBUG=1 -D_GLIBCXX_DEBUG_PEDANTIC=1 -mfix-and-continue -fvisibility-inlines-hidden  -fPIC -c src/Bugcheck.cpp -o /opt/local/var/macports/build/_opt_local_var_macports_sources_rsync.macports.org_release_ports_devel_poco/poco/work/poco-1.3.6p2-all/Foundation/obj/Darwin/x86_64/debug_shared/Bugcheck.o
:info:build ** Compiling src/ByteOrder.cpp (debug, shared)
:info:build /usr/bin/clang++  -Iinclude -I/opt/local/var/macports/build/_opt_local_var_macports_sources_rsync.macports.org_release_ports_devel_poco/poco/work/poco-1.3.6p2-all/CppUnit/include -I/opt/local/var/macports/build/_opt_local_var_macports_sources_rsync.macports.org_release_ports_devel_poco/poco/work/poco-1.3.6p2-all/Foundation/include -I/opt/local/var/macports/build/_opt_local_var_macports_sources_rsync.macports.org_release_ports_devel_poco/poco/work/poco-1.3.6p2-all/XML/include -I/opt/local/var/macports/build/_opt_local_var_macports_sources_rsync.macports.org_release_ports_devel_poco/poco/work/poco-1.3.6p2-all/Util/include -I/opt/local/var/macports/build/_opt_local_var_macports_sources_rsync.macports.org_release_ports_devel_poco/poco/work/poco-1.3.6p2-all/Net/include -I/opt/local/var/macports/build/_opt_local_var_macports_sources_rsync.macports.org_release_ports_devel_poco/poco/work/poco-1.3.6p2-all/Crypto/include -I/opt/local/var/macports/build/_opt_local_var_macports_sources_rsync.macports.org_release_ports_devel_poco/poco/work/poco-1.3.6p2-all/NetSSL_OpenSSL/include -I/opt/local/var/macports/build/_opt_local_var_macports_sources_rsync.macports.org_release_ports_devel_poco/poco/work/poco-1.3.6p2-all/Data/include -I/opt/local/var/macports/build/_opt_local_var_macports_sources_rsync.macports.org_release_ports_devel_poco/poco/work/poco-1.3.6p2-all/Data/SQLite/include -I/opt/local/var/macports/build/_opt_local_var_macports_sources_rsync.macports.org_release_ports_devel_poco/poco/work/poco-1.3.6p2-all/Data/ODBC/include -I/opt/local/var/macports/build/_opt_local_var_macports_sources_rsync.macports.org_release_ports_devel_poco/poco/work/poco-1.3.6p2-all/Data/MySQL/include -I/opt/local/var/macports/build/_opt_local_var_macports_sources_rsync.macports.org_release_ports_devel_poco/poco/work/poco-1.3.6p2-all/Zip/include -I/opt/local/var/macports/build/_opt_local_var_macports_sources_rsync.macports.org_release_ports_devel_poco/poco/work/poco-1.3.6p2-all/PageCompiler/include -arch x86_64 -Wall -Wno-sign-compare -I/opt/local/include -O2 -DPOCO_BUILD_HOST=nikos-yiotiss-macbook-pro.local  -DPOCO_HAVE_IPv6  -O0 -g -gdwarf-2 -D_DEBUG= -D_GLIBCXX_DEBUG=1 -D_GLIBCXX_DEBUG_PEDANTIC=1 -mfix-and-continue -fvisibility-inlines-hidden  -fPIC -c src/ByteOrder.cpp -o /opt/local/var/macports/build/_opt_local_var_macports_sources_rsync.macports.org_release_ports_devel_poco/poco/work/poco-1.3.6p2-all/Foundation/obj/Darwin/x86_64/debug_shared/ByteOrder.o
:info:build ** Compiling src/Channel.cpp (debug, shared)
:info:build /usr/bin/clang++  -Iinclude -I/opt/local/var/macports/build/_opt_local_var_macports_sources_rsync.macports.org_release_ports_devel_poco/poco/work/poco-1.3.6p2-all/CppUnit/include -I/opt/local/var/macports/build/_opt_local_var_macports_sources_rsync.macports.org_release_ports_devel_poco/poco/work/poco-1.3.6p2-all/Foundation/include -I/opt/local/var/macports/build/_opt_local_var_macports_sources_rsync.macports.org_release_ports_devel_poco/poco/work/poco-1.3.6p2-all/XML/include -I/opt/local/var/macports/build/_opt_local_var_macports_sources_rsync.macports.org_release_ports_devel_poco/poco/work/poco-1.3.6p2-all/Util/include -I/opt/local/var/macports/build/_opt_local_var_macports_sources_rsync.macports.org_release_ports_devel_poco/poco/work/poco-1.3.6p2-all/Net/include -I/opt/local/var/macports/build/_opt_local_var_macports_sources_rsync.macports.org_release_ports_devel_poco/poco/work/poco-1.3.6p2-all/Crypto/include -I/opt/local/var/macports/build/_opt_local_var_macports_sources_rsync.macports.org_release_ports_devel_poco/poco/work/poco-1.3.6p2-all/NetSSL_OpenSSL/include -I/opt/local/var/macports/build/_opt_local_var_macports_sources_rsync.macports.org_release_ports_devel_poco/poco/work/poco-1.3.6p2-all/Data/include -I/opt/local/var/macports/build/_opt_local_var_macports_sources_rsync.macports.org_release_ports_devel_poco/poco/work/poco-1.3.6p2-all/Data/SQLite/include -I/opt/local/var/macports/build/_opt_local_var_macports_sources_rsync.macports.org_release_ports_devel_poco/poco/work/poco-1.3.6p2-all/Data/ODBC/include -I/opt/local/var/macports/build/_opt_local_var_macports_sources_rsync.macports.org_release_ports_devel_poco/poco/work/poco-1.3.6p2-all/Data/MySQL/include -I/opt/local/var/macports/build/_opt_local_var_macports_sources_rsync.macports.org_release_ports_devel_poco/poco/work/poco-1.3.6p2-all/Zip/include -I/opt/local/var/macports/build/_opt_local_var_macports_sources_rsync.macports.org_release_ports_devel_poco/poco/work/poco-1.3.6p2-all/PageCompiler/include -arch x86_64 -Wall -Wno-sign-compare -I/opt/local/include -O2 -DPOCO_BUILD_HOST=nikos-yiotiss-macbook-pro.local  -DPOCO_HAVE_IPv6  -O0 -g -gdwarf-2 -D_DEBUG= -D_GLIBCXX_DEBUG=1 -D_GLIBCXX_DEBUG_PEDANTIC=1 -mfix-and-continue -fvisibility-inlines-hidden  -fPIC -c src/Channel.cpp -o /opt/local/var/macports/build/_opt_local_var_macports_sources_rsync.macports.org_release_ports_devel_poco/poco/work/poco-1.3.6p2-all/Foundation/obj/Darwin/x86_64/debug_shared/Channel.o
:info:build In file included from src/AsyncChannel.cpp:39:
:info:build In file included from include/Poco/Message.h:45:
:info:build In file included from /usr/include/c++/4.2.1/map:69:
:info:build In file included from /usr/include/c++/4.2.1/debug/map:39:
:info:build /usr/include/c++/4.2.1/debug/map.h:77:20: error: dependent using declaration resolved to type without 'typename'
:info:build       using _Base::value_compare;
:info:build                    ^
:info:build include/Poco/LoggingRegistry.h:112:15: note: in instantiation of template class 'std::__debug::map<std::basic_string<char, std::char_traits<char>, std::allocator<char> >, Poco::AutoPtr<Poco::Channel>, std::less<std::basic_string<char, std::char_traits<char>, std::allocator<char> > >, std::allocator<std::pair<const std::basic_string<char, std::char_traits<char>, std::allocator<char> >, Poco::AutoPtr<Poco::Channel> > > >' requested here
:info:build         ChannelMap   _channelMap;
:info:build                      ^
:info:build /usr/include/c++/4.2.1/bits/stl_map.h:111:13: note: target of using declaration
:info:build       class value_compare
:info:build             ^
:info:build In file included from src/AsyncChannel.cpp:39:
:info:build In file included from include/Poco/Message.h:45:
:info:build In file included from /usr/include/c++/4.2.1/map:69:
:info:build In file included from /usr/include/c++/4.2.1/debug/map:39:
:info:build /usr/include/c++/4.2.1/debug/map.h:77:20: error: dependent using declaration resolved to type without 'typename'
:info:build       using _Base::value_compare;
:info:build                    ^
:info:build include/Poco/LoggingRegistry.h:113:15: note: in instantiation of template class 'std::__debug::map<std::basic_string<char, std::char_traits<char>, std::allocator<char> >, Poco::AutoPtr<Poco::Formatter>, std::less<std::basic_string<char, std::char_traits<char>, std::allocator<char> > >, std::allocator<std::pair<const std::basic_string<char, std::char_traits<char>, std::allocator<char> >, Poco::AutoPtr<Poco::Formatter> > > >' requested here
:info:build         FormatterMap _formatterMap;
:info:build                      ^
:info:build /usr/include/c++/4.2.1/bits/stl_map.h:111:13: note: target of using declaration
:info:build       class value_compare
:info:build             ^
:info:build 2 errors generated.
:info:build make[1]: *** [/opt/local/var/macports/build/_opt_local_var_macports_sources_rsync.macports.org_release_ports_devel_poco/poco/work/poco-1.3.6p2-all/Foundation/obj/Darwin/x86_64/debug_shared/AsyncChannel.o] Error 1
:info:build make[1]: *** Waiting for unfinished jobs....
:info:build make[1]: Leaving directory `/opt/local/var/macports/build/_opt_local_var_macports_sources_rsync.macports.org_release_ports_devel_poco/poco/work/poco-1.3.6p2-all/Foundation'
:info:build make: *** [Foundation-libexec] Error 2
:info:build make: Leaving directory `/opt/local/var/macports/build/_opt_local_var_macports_sources_rsync.macports.org_release_ports_devel_poco/poco/work/poco-1.3.6p2-all'
:info:build Command failed:  cd "/opt/local/var/macports/build/_opt_local_var_macports_sources_rsync.macports.org_release_ports_devel_poco/poco/work/poco-1.3.6p2-all" && /usr/bin/make -j4 -w poco CC=/usr/bin/clang CXX=/usr/bin/clang++ CPP=/usr/bin/cpp 
:info:build Exit code: 2
:error:build org.macports.build for port poco returned: command execution failed
:debug:build Error code: CHILDSTATUS 90662 2
:debug:build Backtrace: command execution failed
    while executing
"system -nice 0 $fullcmdstring"
    ("eval" body line 1)
    invoked from within
"eval system $notty $nice \$fullcmdstring"
    invoked from within
"command_exec build"
    (procedure "portbuild::build_main" line 8)
    invoked from within
"$procedure $targetname"
:info:build Warning: targets not executed for poco: org.macports.install org.macports.build org.macports.destroot
:notice:build Please see the log file for port poco for details:
    /opt/local/var/macports/logs/_opt_local_var_macports_sources_rsync.macports.org_release_ports_devel_poco/poco/main.log


Create a new paste based on this one


Comments: